[Kratos] Kratos Nigthly Report - gcc

Kratos Benchmarking kratos-no-reply en cimne.upc.edu
Jue Oct 8 02:07:18 CEST 2015


--- Kratos Benchmarking Tests ---
This is an automatically generated e-mail with the nightly tests of 08-10-15.0000.

### This is a GCC compilation/benchmarking ###

--------------------GCC Compiling Status--------------------- 

Failed Applications : 0
Compiling Errors    : 22
/data0/auto-test/kratos-code/applications/SolidMechanicsApplication/custom_utilities/energy_utilities.h:111: error: using ‘typename’ outside of template
/data0/auto-test/kratos-code/applications/SolidMechanicsApplication/custom_utilities/energy_utilities.h:112: error: using ‘typename’ outside of template
/data0/auto-test/kratos-code/applications/SolidMechanicsApplication/custom_utilities/energy_utilities.h:170: error: using ‘typename’ outside of template
/data0/auto-test/kratos-code/applications/SolidMechanicsApplication/custom_utilities/energy_utilities.h:171: error: using ‘typename’ outside of template
/data0/auto-test/kratos-code/applications/SolidMechanicsApplication/custom_utilities/energy_utilities.h:233: error: using ‘typename’ outside of template
/data0/auto-test/kratos-code/applications/SolidMechanicsApplication/custom_utilities/energy_utilities.h:234: error: using ‘typename’ outside of template
/data0/auto-test/kratos-code/applications/SolidMechanicsApplication/custom_utilities/energy_utilities.h:307: error: using ‘typename’ outside of template
/data0/auto-test/kratos-code/applications/SolidMechanicsApplication/custom_utilities/energy_utilities.h:308: error: using ‘typename’ outside of template
/data0/auto-test/kratos-code/applications/SolidMechanicsApplication/custom_utilities/energy_utilities.h:326: error: using ‘typename’ outside of template
/data0/auto-test/kratos-code/applications/SolidMechanicsApplication/custom_utilities/energy_utilities.h:327: error: using ‘typename’ outside of template
/data0/auto-test/kratos-code/applications/SolidMechanicsApplication/custom_utilities/energy_utilities.h:329: error: using ‘typename’ outside of template
/data0/auto-test/kratos-code/applications/SolidMechanicsApplication/custom_utilities/energy_utilities.h:111: error: using ‘typename’ outside of template
/data0/auto-test/kratos-code/applications/SolidMechanicsApplication/custom_utilities/energy_utilities.h:112: error: using ‘typename’ outside of template
/data0/auto-test/kratos-code/applications/SolidMechanicsApplication/custom_utilities/energy_utilities.h:170: error: using ‘typename’ outside of template
/data0/auto-test/kratos-code/applications/SolidMechanicsApplication/custom_utilities/energy_utilities.h:171: error: using ‘typename’ outside of template
/data0/auto-test/kratos-code/applications/SolidMechanicsApplication/custom_utilities/energy_utilities.h:233: error: using ‘typename’ outside of template
/data0/auto-test/kratos-code/applications/SolidMechanicsApplication/custom_utilities/energy_utilities.h:234: error: using ‘typename’ outside of template
/data0/auto-test/kratos-code/applications/SolidMechanicsApplication/custom_utilities/energy_utilities.h:307: error: using ‘typename’ outside of template
/data0/auto-test/kratos-code/applications/SolidMechanicsApplication/custom_utilities/energy_utilities.h:308: error: using ‘typename’ outside of template
/data0/auto-test/kratos-code/applications/SolidMechanicsApplication/custom_utilities/energy_utilities.h:326: error: using ‘typename’ outside of template
/data0/auto-test/kratos-code/applications/SolidMechanicsApplication/custom_utilities/energy_utilities.h:327: error: using ‘typename’ outside of template
/data0/auto-test/kratos-code/applications/SolidMechanicsApplication/custom_utilities/energy_utilities.h:329: error: using ‘typename’ outside of template
Compiling Warnings  : 3
/data0/auto-test/kratos-code/applications/ExternalSolversApplication/custom_external_libraries/amgcl/preconditioner/simple.hpp:208: warning: comparison between signed and unsigned integer expressions
/data0/auto-test/kratos-code/applications/ExternalSolversApplication/custom_external_libraries/amgcl/preconditioner/simple.hpp:209: warning: comparison between signed and unsigned integer expressions
/data0/auto-test/kratos-code/applications/ExternalSolversApplication/custom_external_libraries/amgcl/preconditioner/simple.hpp:216: warning: comparison between signed and unsigned integer expressions
Linking Error       : 0
---start solid mechanics application tests---
running the Scordelis Low Roof benchmark test...
Scordelis Low Roof test FAILED
running the Shell Q4 Thick Bending RollUp benchmark test...
Shell Q4 Thick Bending RollUp test FAILED
running the Shell Q4 Thick Drilling RollUp benchmark test...
Shell Q4 Thick Drilling RollUp test FAILED
running the Shell T3 Thin Bending RollUp benchmark test...
Shell T3 Thin Bending RollUp test FAILED
running the Shell T3 Thin Drilling RollUp benchmark test...
Shell T3 Thin Drilling RollUp test FAILED
---end solid mechanics application tests---
resume of all of the examples for the SolidMechanicsApplication :
===== Solid Mechanics Application =====
Shell T3 Isotropic  Scordelis  test: FAILED
Different amount of benchmark data!

Shell Q4 Thick Bending  RollUp test: FAILED
Different amount of benchmark data!

Shell Q4 Thick Drilling RollUp test: FAILED
Different amount of benchmark data!

Shell T3 Thin  Bending  RollUp test: FAILED
Different amount of benchmark data!

Shell T3 Thin  Drilling RollUp test: FAILED
Different amount of benchmark data!


running the vms2d_test benchmark test...
VMS2D element test FAILED
Running VMS test: parabolic flow in a trapezoidal domain solved using OSS
oss_trapezoid test FAILED
Running slip condition test...
slip condition test FAILED
Running Fractional step element test: 2D cavity flow
Fractional step 2D cavity test FAILED
Running test of cylinder with slip BC, wall law and outlet close to the cylinder
cylinder with slip BC, wall law and outlet test FAILED
resume of all of the examples for the Fluid Dynamics application :
== Fluid Dynamics ==========
VMS2D element test: FAILED
Different amount of benchmark data!

Parabolic flow OSS test: FAILED
Different amount of benchmark data!

Slip condition and wall law test: FAILED
Different amount of benchmark data!

Fractional step element test: 2D cavity flow: FAILED
Different amount of benchmark data!

test of cylinder with slip BC, wall law and outlet close to the cylinder: FAILED
Different amount of benchmark data!



Starting DEM Benchmarking..............

Running DEM Benchmark 1... Elastic normal impact of two identical spheres

A problem was found in DEM Benchmark 1... Resuming...

Running DEM Benchmark 2... Elastic normal impact of a sphere against a rigid plane

A problem was found in DEM Benchmark 2... Resuming...

Running DEM Benchmark 3... Impact of a sphere against a rigid plane with different coefficients of restitution

A problem was found in DEM Benchmark 3... Resuming...

Running DEM Benchmark 4... Oblique impact of a sphere with a rigid plane with constant velocity module and variable incident angles

A problem was found in DEM Benchmark 4... Resuming...

Running DEM Benchmark 5... Oblique impact of a sphere with a rigid plane with constant normal velocity and different angular velocities

A problem was found in DEM Benchmark 5... Resuming...

Running DEM Benchmark 6... Impact of a sphere with a rigid plane with a constant normal velocity and variable angular velocities

A problem was found in DEM Benchmark 6... Resuming...

Running DEM Benchmark 7... Impact of two identical spheres with a constant normal velocity and different angular velocities

A problem was found in DEM Benchmark 7... Resuming...

Running DEM Benchmark 8... Impact of two differently sized spheres with a constant normal velocity and variable angular velocities

A problem was found in DEM Benchmark 8... Resuming...

Running DEM Benchmark 9... Impact of two identical spheres with a constant normal velocity and different coefficients of restitution

A problem was found in DEM Benchmark 9... Resuming...

Running DEM Benchmark 20... Normal compression of two identical spheres

A problem was found in DEM Benchmark 20... Resuming...

Running DEM Benchmark 21... Normal compression of two identical indented spheres

A problem was found in DEM Benchmark 21... Resuming...

Running DEM Benchmark 22... Tensile test of two identical spheres

A problem was found in DEM Benchmark 22... Resuming...

Running DEM Benchmark 23... Tensile test of two identical indented spheres

A problem was found in DEM Benchmark 23... Resuming...

Running DEM Benchmark 24... Shear test of two identical spheres by applying rotation

A problem was found in DEM Benchmark 24... Resuming...

Running DEM Benchmark 25... Shear test of two identical spheres by applying rotation and radius expansion

A problem was found in DEM Benchmark 25... Resuming...



Running Patch_Test_Total_Lagrangian_3D_8N...
Patch_Test_Total_Lagrangian_3D_8N_benchmarking.py example FAILED
Running Patch_Test_Total_Lagrangian_4N...
Patch_Test_Total_Lagrangian_4N_benchmarking.py example FAILED
Running cantilever2ddynamic
cantilever2dynamic example FAILED
Running cantilever2dstatic using MKLPardisoSolver
Expected fail because the  program should be compiled with INTEL compliler.
Running cantilever2dstatic witdh SuperLUSolver
cantilever2dstatic witdh SuperLUSolver example FAILED
Running cantilever2dstatic with classical solver
cantilever2dstatic with classical solver example FAILED
Running cantilever2dstatic_parallel using ParallelSkylineLUFactorizationSolver
Expected fail because the  program should be compiled with INTEL compliler.
Running cantilever2dstatic using ParallelMKLPardisoSolver
Expected fail because the  program should be compiled with INTEL compliler.
Running cantilever3dstatic
cantilever3dstatic example FAILED
Running cantilever3dynamic
cantilever2dynamic  example FAILED
Running balken contact benchmark...
balken contact benchmark example FAILED
Running arc length desplacement  benchmark...
arc_length_des benchmark example FAILED
Running arc length  benchmark...
arc_length benchmark example FAILED
Pendulo Kratos Length benchmark...
Pendulo Kratos benchmark example FAILED
PlasticitJ2 with EBST TENSION benchmarks...
PlasticitJ2 with EBST TENSION benchmarks FAILED
PlasticitJ2 with EBST TORSION benchmarks...
PlasticitJ2 with EBST TORSION benchmarks FAILED
PlasticitJ2 with EBST VERTICAL benchmarks...
PlasticitJ2 with EBST VERTICAL benchmarks FAILED
PlasticitJ2 with EBST FORCE benchmarks...
PlasticitJ2 with EBST FORCE benchmarks FAILED
Resume of all of the examples for the structural application :
========== Structural Aplication ==========
Patch_Test_Total_Lagrangian_3D_8N: FAILED
Different amount of benchmark data!

Patch_Test_Total_Lagrangian_4N: FAILED
Different amount of benchmark data!

cantilever2dDynamic:FAILED
Different amount of benchmark data!

cantilever2dstatic using MKLPardisoSolver: FAILED
Different amount of benchmark data!

cantilever2dstatic_superlu: FAILED
Different amount of benchmark data!

cantilever2dstatic: FAILED
Different amount of benchmark data!

cantilever2dstatic_parallel:FAILED
Different amount of benchmark data!

cantilever2dstatic using ParallelMKLPardisoSolver: FAILED
Different amount of benchmark data!

cantilever3dstatic: FAILED
Different amount of benchmark data!

cantilever3ddynamic: FAILED
Different amount of benchmark data!

balken contact benchmark: FAILED
Different amount of benchmark data!

arc length desplacement benchmark: FAILED
Different amount of benchmark data!

arc length benchmark: FAILED
Different amount of benchmark data!

Pendulo Kratos Length benchmark: FAILED
Different amount of benchmark data!

PlasticitJ2 with EBST collection benchmarks: FAILED
Different amount of benchmark data!

FAILED
Different amount of benchmark data!

FAILED
Different amount of benchmark data!

FAILED
Different amount of benchmark data!


running the benchmark for naca3d test...
naca3d test example FAILED
running the benchmark for mass_conservation test...
mass_conservation test example FAILED
verifying  test_fractstep_cont_laplacian.py...
test_fractstep_cont_laplacian example FAILED
verifying  test_fractstep_discrete_laplacian.py...
test_fractstep_discrete_laplacian example FAILED
verifying  test_fractstep_cont_laplacian.py...3D
test_fractstep_cont_laplacian 3D example FAILED
Running cylinder.py...
cylinder example FAILED
Running Cilinder GLS example with explicit Runge-Kutta and FRAC STEP...
cilinderGLS example FAILED
Running StillWater_Edgebased...
StillWater_Edgebased example FAILED
Running StillWater_Edgebased_halfPorous...
StillWater_Edgebased_halfPorous example FAILED
Running script.py...
cavity_monolithic_3d example FAILED
running the benchmark for edgebased_fixed_press test...
edgebased_fixed_press test example FAILED
resume of all of the examples for the fluid application :
== Incompressible_Fluid ==========
naca3d test: FAILED
Different amount of benchmark data!

mass conservation test: FAILED
Different amount of benchmark data!

cavity2D: FAILED
Different amount of benchmark data!

FAILED
Different amount of benchmark data!

cavity3D: FAILED
Different amount of benchmark data!

cylinder: FAILED
Different amount of benchmark data!

cilinderGLS: FAILED
Different amount of benchmark data!

StillWater_Edgebased: FAILED
Different amount of benchmark data!

StillWater_Edgebased_halfPorous: FAILED
Different amount of benchmark data!

cavity_monolithic_3d: FAILED
Different amount of benchmark data!

edgebased fixed press test: FAILED
Different amount of benchmark data!


Running edgebased_PureConvection.py...
testConvectionEdgebased example FAILED
Running testPureConvection.py...
testPureConvection example FAILED
resume of all of the examples for the fluid application :
== Convection_Diffusion ==========
square_edgebased: FAILED
Different amount of benchmark data!

pure_convection: FAILED
Different amount of benchmark data!


Running mesh.py...
non-conformant mesh example FAILED
resume of all of the examples for the FSI application :
== FSI_application ==========
meshtest: FAILED
Different amount of benchmark data!


Running mesh.py...
non-conformant mesh example FAILED
resume of all of the examples for the FSI application :
== FSI_application ==========
meshtest: FAILED
Different amount of benchmark data!


running the benchmark for the Activation_test ...
Activation_test example FAILED
resume of all of the examples for the ThermoMechanical Application  :
== ThermoMechanical Application ==========
Activation_test : FAILED
Different amount of benchmark data!


running the benchmark for the Activation_test ...
Activation_test example FAILED
resume of all of the examples for the ThermoMechanical Application  :
== ThermoMechanical Application ==========
Activation_test : FAILED
Different amount of benchmark data!


Running Trilinos -- Cantilever_Amesos...
Different amount of benchmark data!
cantilever_amesos.py example FAILED
Running Trilinos -- Cantilever_Aztec...
Different amount of benchmark data!
cantilever_aztec.py example FAILED
Running Trilinos -- Cantilever_ML...
Different amount of benchmark data!
cantilever_ML.py example FAILED
resume of all of the examples for the fluid application :
========== Trilinos Aplication ==========
Trilinos -- Cantilever_Amesos: FAILED
Different amount of benchmark data!

Trilinos -- Cantilever_Aztec: FAILED
Different amount of benchmark data!

Trilinos -- Cantilever_ML (including rotations in null space): FAILED
Different amount of benchmark data!



Starting swimming_DEM Benchmarks..............

Status of Kratos examples:

===== Solid Mechanics Application =====
Shell T3 Isotropic  Scordelis  test: FAILED
Different amount of benchmark data!

Shell Q4 Thick Bending  RollUp test: FAILED
Different amount of benchmark data!

Shell Q4 Thick Drilling RollUp test: FAILED
Different amount of benchmark data!

Shell T3 Thin  Bending  RollUp test: FAILED
Different amount of benchmark data!

Shell T3 Thin  Drilling RollUp test: FAILED
Different amount of benchmark data!

== Fluid Dynamics ==========
VMS2D element test: FAILED
Different amount of benchmark data!

Parabolic flow OSS test: FAILED
Different amount of benchmark data!

Slip condition and wall law test: FAILED
Different amount of benchmark data!

Fractional step element test: 2D cavity flow: FAILED
Different amount of benchmark data!

test of cylinder with slip BC, wall law and outlet close to the cylinder: FAILED
Different amount of benchmark data!


========== DEM BENCHMARKING RESULTS ==========

== BASIC DISCONTINUUM TESTS, SLIDING REGIME ==

DEM Benchmark 1: KO!........ Test 1 FAILED
DEM Benchmark 2: KO!........ Test 2 FAILED
DEM Benchmark 3: KO!........ Test 3 FAILED
DEM Benchmark 4: KO!........ Test 4 FAILED
DEM Benchmark 5: KO!........ Test 5 FAILED
DEM Benchmark 6: KO!........ Test 6 FAILED
DEM Benchmark 7: KO!........ Test 7 FAILED
DEM Benchmark 8: KO!........ Test 8 FAILED
DEM Benchmark 9: KO!........ Test 9 FAILED
DEM Benchmark 20: KO!........ Test 20 FAILED
DEM Benchmark 21: KO!........ Test 21 FAILED
DEM Benchmark 22: KO!........ Test 22 FAILED
DEM Benchmark 23: KO!........ Test 23 FAILED
DEM Benchmark 24: KO!........ Test 24 FAILED
DEM Benchmark 25: KO!........ Test 25 FAILED


========== Structural Aplication ==========
Patch_Test_Total_Lagrangian_3D_8N: FAILED
Different amount of benchmark data!

Patch_Test_Total_Lagrangian_4N: FAILED
Different amount of benchmark data!

cantilever2dDynamic:FAILED
Different amount of benchmark data!

cantilever2dstatic using MKLPardisoSolver: FAILED
Different amount of benchmark data!

cantilever2dstatic_superlu: FAILED
Different amount of benchmark data!

cantilever2dstatic: FAILED
Different amount of benchmark data!

cantilever2dstatic_parallel:FAILED
Different amount of benchmark data!

cantilever2dstatic using ParallelMKLPardisoSolver: FAILED
Different amount of benchmark data!

cantilever3dstatic: FAILED
Different amount of benchmark data!

cantilever3ddynamic: FAILED
Different amount of benchmark data!

balken contact benchmark: FAILED
Different amount of benchmark data!

arc length desplacement benchmark: FAILED
Different amount of benchmark data!

arc length benchmark: FAILED
Different amount of benchmark data!

Pendulo Kratos Length benchmark: FAILED
Different amount of benchmark data!

PlasticitJ2 with EBST collection benchmarks: FAILED
Different amount of benchmark data!

FAILED
Different amount of benchmark data!

FAILED
Different amount of benchmark data!

FAILED
Different amount of benchmark data!

== Incompressible_Fluid ==========
naca3d test: FAILED
Different amount of benchmark data!

mass conservation test: FAILED
Different amount of benchmark data!

cavity2D: FAILED
Different amount of benchmark data!

FAILED
Different amount of benchmark data!

cavity3D: FAILED
Different amount of benchmark data!

cylinder: FAILED
Different amount of benchmark data!

cilinderGLS: FAILED
Different amount of benchmark data!

StillWater_Edgebased: FAILED
Different amount of benchmark data!

StillWater_Edgebased_halfPorous: FAILED
Different amount of benchmark data!

cavity_monolithic_3d: FAILED
Different amount of benchmark data!

edgebased fixed press test: FAILED
Different amount of benchmark data!

== Convection_Diffusion ==========
square_edgebased: FAILED
Different amount of benchmark data!

pure_convection: FAILED
Different amount of benchmark data!

== FSI_application ==========
meshtest: FAILED
Different amount of benchmark data!

== ThermoMechanical Application ==========
Activation_test : FAILED
Different amount of benchmark data!

========== Trilinos Aplication ==========
Trilinos -- Cantilever_Amesos: FAILED
Different amount of benchmark data!

Trilinos -- Cantilever_Aztec: FAILED
Different amount of benchmark data!

Trilinos -- Cantilever_ML (including rotations in null space): FAILED
Different amount of benchmark data!



Benchmarking:

Benchmarking:
### Process ended. ###
------------ próxima parte ------------
Se ha borrado un mensaje que no está en formato texto plano...
Nombre     : gcc_logfile.zip
Tipo       : application/zip
Tamaño     : 7844 bytes
Descripción: no disponible
Url        : http://listas.cimne.upc.edu/pipermail/kratos/attachments/20151008/2396978c/attachment-0001.zip 


Más información sobre la lista de distribución Kratos