[Kratos] Latest version of the code is not compiling

Mini, Andreas andreas.mini en tum.de
Lun Jun 15 17:05:37 CEST 2015


Dear colleagues,


I have downloaded the latest version of the code. Unfortunately it does not compile. I get the following error message:


In file included from /home/mini/compiled_libraries/boost_1_57_0/boost/lexical_cast/detail/converter_lexical.hpp:49:0,
                 from /home/mini/compiled_libraries/boost_1_57_0/boost/lexical_cast/try_lexical_convert.hpp:34,
                 from /home/mini/compiled_libraries/boost_1_57_0/boost/lexical_cast.hpp:32,
                 from /home/mini/compiled_libraries/boost_1_57_0/boost/python/operators.hpp:19,
                 from /home/mini/compiled_libraries/boost_1_57_0/boost/python.hpp:50,
                 from /home/mini/Desktop/KRATOS_TEST/kratos/applications/PFEMapplication/custom_python/add_custom_utilities_to_python.cpp:54:
/home/mini/compiled_libraries/boost_1_57_0/boost/array.hpp: In function '<built-in>':
/home/mini/compiled_libraries/boost_1_57_0/boost/array.hpp:130:25: warning: array subscript is above array bounds [-Warray-bounds]
             return elems[i];
                         ^
Linking CXX shared library KratosExternalSolversApplication.so
custom_external_libraries/ITSOL_2/libitsol.a(auxill.c.o): In function `readhb_c':
auxill.c:(.text+0x14fb): undefined reference to `readmtc_'
auxill.c:(.text+0x172f): undefined reference to `readmtc_'
auxill.c:(.text+0x182b): undefined reference to `csrcsc_'
custom_external_libraries/ITSOL_2/libitsol.a(auxill.c.o): In function `readhb_2':
auxill.c:(.text+0x1de1): undefined reference to `readmtc_'
auxill.c:(.text+0x200d): undefined reference to `readmtc_'
auxill.c:(.text+0x255b): undefined reference to `csrcsc_'
custom_external_libraries/ITSOL_2/libitsol.a(sets.c.o): In function `coocsc':
sets.c:(.text+0x4125): undefined reference to `coocsr_'
sets.c:(.text+0x41e2): undefined reference to `coocsr_'
collect2: error: ld returned 1 exit status
make[2]: *** [applications/ExternalSolversApplication/KratosExternalSolversApplication.so] Error 1
make[1]: *** [applications/ExternalSolversApplication/CMakeFiles/KratosExternalSolversApplication.dir/all] Error 2


Thank you for your help.


Ciao

Andreas Mini

-------------------------------------------------------
Technische Universität München
Lehrstuhl für Statik
Prof. Dr.-Ing. Kai-Uwe Bletzinger
Arcisstr. 21
80333 München

Tel. +49 (0)89 289 22435
Fax +49 (0)89 289 22421
Andreas.Mini at tum.de
www.st.bgu.tum.de
-------------------------------------------------------
-------------- next part --------------
An HTML attachment was scrubbed...
URL: http://listas.cimne.upc.edu/pipermail/kratos/attachments/20150615/0d26cb40/attachment.htm 


Más información sobre la lista de distribución Kratos