[Kratos] Kratos Nigthly Report - gcc

Kratos Benchmarking kratos-no-reply en cimne.upc.edu
Jue Oct 30 01:16:17 CET 2014


--- Kratos Benchmarking Tests ---
This is an automatically generated e-mail with the nightly tests of 30-10-14.0000.

### This is a GCC compilation/benchmarking ###

--------------------GCC Compiling Status--------------------- 

Failed Applications : 0
Compiling Errors    : 0
Compiling Warnings  : 4
/data0/auto-test/kratos-code/kratos/containers/array_1d.h:325: warning: array subscript is above array bounds
/data0/auto-test/kratos-code/kratos/containers/array_1d.h:325: warning: array subscript is above array bounds
/data0/auto-test/kratos-code/kratos/containers/array_1d.h:325: warning: array subscript is above array bounds
/data0/auto-test/kratos-code/kratos/containers/array_1d.h:325: warning: array subscript is above array bounds
Linking Error       : 0
Warning: couldn't find xdpyinfo to determine GLX availability. 
Configuring GiD for Software Rendering
---start solid mechanics application tests---
running the Scordelis Low Roof benchmark test...
Scordelis Low Roof test FAILED
running the Shell Q4 Thick Bending RollUp benchmark test...
Shell Q4 Thick Bending RollUp test FAILED
running the Shell Q4 Thick Drilling RollUp benchmark test...
Shell Q4 Thick Drilling RollUp test FAILED
running the Shell T3 Thin Bending RollUp benchmark test...
Shell T3 Thin Bending RollUp test FAILED
running the Shell T3 Thin Drilling RollUp benchmark test...
Shell T3 Thin Drilling RollUp test FAILED
---end solid mechanics application tests---
resume of all of the examples for the SolidMechanicsApplication :
===== Solid Mechanics Application =====
Shell T3 Isotropic  Scordelis  test: FAILED
Different amount of benchmark data!

Shell Q4 Thick Bending  RollUp test: FAILED
Different amount of benchmark data!

Shell Q4 Thick Drilling RollUp test: FAILED
Different amount of benchmark data!

Shell T3 Thin  Bending  RollUp test: FAILED
Different amount of benchmark data!

Shell T3 Thin  Drilling RollUp test: FAILED
Different amount of benchmark data!


running the vms2d_test benchmark test...
VMS2D element test FAILED
Running VMS test: parabolic flow in a trapezoidal domain solved using OSS
oss_trapezoid test FAILED
Running slip condition test...
slip condition test FAILED
Running Fractional step element test: 2D cavity flow
Fractional step 2D cavity test FAILED
Running test of cylinder with slip BC, wall law and outlet close to the cylinder
cylinder with slip BC, wall law and outlet test FAILED
resume of all of the examples for the Fluid Dynamics application :
== Fluid Dynamics ==========
VMS2D element test: FAILED
Different amount of benchmark data!

Parabolic flow OSS test: FAILED
Different amount of benchmark data!

Slip condition and wall law test: FAILED
Different amount of benchmark data!

Fractional step element test: 2D cavity flow: FAILED
Different amount of benchmark data!

test of cylinder with slip BC, wall law and outlet close to the cylinder: FAILED
Different amount of benchmark data!


Problem updated...

Benchmarking:

Benchmarking:
### Process ended. ###
------------ próxima parte ------------
Se ha borrado un mensaje que no está en formato texto plano...
Nombre     : gcc_logfile.zip
Tipo       : application/zip
Tamaño     : 6168 bytes
Descripción: no disponible
Url        : http://listas.cimne.upc.edu/pipermail/kratos/attachments/20141030/db43a248/attachment-0001.zip 


Más información sobre la lista de distribución Kratos