[Kratos] Kratos Nigthly Report - gcc

Kratos Benchmarking kratos-no-reply en cimne.upc.edu
Sab Oct 4 01:15:23 CEST 2014


--- Kratos Benchmarking Tests ---
This is an automatically generated e-mail with the nightly tests of 04-10-14.0000.

### This is a GCC compilation/benchmarking ###

--------------------GCC Compiling Status--------------------- 

Failed Applications : 0
Compiling Errors    : 8
/data0/auto-test/kratos-code/kratos/python/add_utilities_to_python.cpp:68:44: error: utilities/activation_utilities.h: No such file or directory
/data0/auto-test/kratos-code/kratos/python/add_utilities_to_python.cpp:260: error: ‘ActivationUtilities’ was not declared in this scope
/data0/auto-test/kratos-code/kratos/python/add_utilities_to_python.cpp:260: error: template argument 1 is invalid
/data0/auto-test/kratos-code/kratos/python/add_utilities_to_python.cpp:261: error: ‘ActivationUtilities’ is not a class or namespace
/data0/auto-test/kratos-code/kratos/python/add_utilities_to_python.cpp:68:44: error: utilities/activation_utilities.h: No such file or directory
/data0/auto-test/kratos-code/kratos/python/add_utilities_to_python.cpp:260: error: ‘ActivationUtilities’ was not declared in this scope
/data0/auto-test/kratos-code/kratos/python/add_utilities_to_python.cpp:260: error: template argument 1 is invalid
/data0/auto-test/kratos-code/kratos/python/add_utilities_to_python.cpp:261: error: ‘ActivationUtilities’ is not a class or namespace
Compiling Warnings  : 14
/data0/auto-test/kratos-code/kratos/containers/array_1d.h:325: warning: array subscript is above array bounds
/data0/auto-test/kratos-code/kratos/containers/array_1d.h:325: warning: array subscript is above array bounds
/data0/auto-test/kratos-code/kratos/containers/array_1d.h:325: warning: array subscript is above array bounds
/data0/auto-test/kratos-code/kratos/containers/array_1d.h:325: warning: array subscript is above array bounds
/data0/compiled_libraries/boost/include/boost/numeric/ublas/functional.hpp:694: warning: ‘dxprim12’ may be used uninitialized in this function
/data0/compiled_libraries/boost/include/boost/numeric/ublas/functional.hpp:694: warning: ‘dxprim32’ may be used uninitialized in this function
/data0/compiled_libraries/boost/include/boost/numeric/ublas/functional.hpp:694: warning: ‘dvprim12’ may be used uninitialized in this function
/usr/include/python2.6/pyconfig-64.h:1034:1: warning: "_POSIX_C_SOURCE" redefined
/usr/include/features.h:162:1: warning: this is the location of the previous definition
/usr/include/python2.6/pyconfig-64.h:1043:1: warning: "_XOPEN_SOURCE" redefined
/usr/include/features.h:164:1: warning: this is the location of the previous definition
/data0/auto-test/kratos-code/applications/incompressible_fluid_application/custom_utilities/embedded_utilities.h:105: warning: ‘IntersectionVel.Kratos::array_1d<double, 3ul>::data_.boost::array<double, 3ul>::elems[0u]’ may be used uninitialized in this function
/data0/auto-test/kratos-code/applications/incompressible_fluid_application/custom_utilities/embedded_utilities.h:105: warning: ‘IntersectionVel.Kratos::array_1d<double, 3ul>::data_.boost::array<double, 3ul>::elems[2u]’ may be used uninitialized in this function
/data0/auto-test/kratos-code/applications/incompressible_fluid_application/custom_utilities/embedded_utilities.h:105: warning: ‘IntersectionVel.Kratos::array_1d<double, 3ul>::data_.boost::array<double, 3ul>::elems[1u]’ may be used uninitialized in this function
Linking Error       : 0
Warning: couldn't find xdpyinfo to determine GLX availability. 
Configuring GiD for Software Rendering
---start solid mechanics application tests---
running the Scordelis Low Roof benchmark test...
Scordelis Low Roof test FAILED
running the Shell Q4 Thick Bending RollUp benchmark test...
Shell Q4 Thick Bending RollUp test FAILED
running the Shell Q4 Thick Drilling RollUp benchmark test...
Shell Q4 Thick Drilling RollUp test FAILED
running the Shell T3 Thin Bending RollUp benchmark test...
Shell T3 Thin Bending RollUp test FAILED
running the Shell T3 Thin Drilling RollUp benchmark test...
Shell T3 Thin Drilling RollUp test FAILED
---end solid mechanics application tests---
resume of all of the examples for the SolidMechanicsApplication :
===== Solid Mechanics Application =====
Shell T3 Isotropic  Scordelis  test: FAILED
Different amount of benchmark data!

Shell Q4 Thick Bending  RollUp test: FAILED
Different amount of benchmark data!

Shell Q4 Thick Drilling RollUp test: FAILED
Different amount of benchmark data!

Shell T3 Thin  Bending  RollUp test: FAILED
Different amount of benchmark data!

Shell T3 Thin  Drilling RollUp test: FAILED
Different amount of benchmark data!


running the vms2d_test benchmark test...
VMS2D element test FAILED
Running VMS test: parabolic flow in a trapezoidal domain solved using OSS
oss_trapezoid test FAILED
Running slip condition test...
slip condition test FAILED
Running Fractional step element test: 2D cavity flow
Fractional step 2D cavity test FAILED
Running test of cylinder with slip BC, wall law and outlet close to the cylinder
cylinder with slip BC, wall law and outlet test FAILED
resume of all of the examples for the Fluid Dynamics application :
== Fluid Dynamics ==========
VMS2D element test: FAILED
Different amount of benchmark data!

Parabolic flow OSS test: FAILED
Different amount of benchmark data!

Slip condition and wall law test: FAILED
Different amount of benchmark data!

Fractional step element test: 2D cavity flow: FAILED
Different amount of benchmark data!

test of cylinder with slip BC, wall law and outlet close to the cylinder: FAILED
Different amount of benchmark data!


Problem updated...
Python script updated...
running the DEM two_balls_no_damp test...
two_balls_no_damp example test FAILED
resume of all of the examples for the DEM application :
========== DEM ==========
DEM element no damp test: FAILED
Different amount of benchmark data!


Running Patch_Test_Total_Lagrangian_3D_8N...
Patch_Test_Total_Lagrangian_3D_8N_benchmarking.py example FAILED
Running Patch_Test_Total_Lagrangian_4N...
Patch_Test_Total_Lagrangian_4N_benchmarking.py example FAILED
Running cantilever2ddynamic
cantilever2dynamic example FAILED
Running cantilever2dstatic using MKLPardisoSolver
Expected fail because the  program should be compiled with INTEL compliler.
Running cantilever2dstatic witdh SuperLUSolver
cantilever2dstatic witdh SuperLUSolver example FAILED
Running cantilever2dstatic with classical solver
cantilever2dstatic with classical solver example FAILED
Running cantilever2dstatic_parallel using ParallelSkylineLUFactorizationSolver
Expected fail because the  program should be compiled with INTEL compliler.
Running cantilever2dstatic using ParallelMKLPardisoSolver
Expected fail because the  program should be compiled with INTEL compliler.
Running cantilever3dstatic
cantilever3dstatic example FAILED
Running cantilever3dynamic
cantilever2dynamic  example FAILED
Running balken contact benchmark...
balken contact benchmark example FAILED
Running arc length desplacement  benchmark...
arc_length_des benchmark example FAILED
Running arc length  benchmark...
arc_length benchmark example FAILED
Pendulo Kratos Length benchmark...
Pendulo Kratos benchmark example FAILED
PlasticitJ2 with EBST TENSION benchmarks...
PlasticitJ2 with EBST TENSION benchmarks FAILED
PlasticitJ2 with EBST TORSION benchmarks...
PlasticitJ2 with EBST TORSION benchmarks FAILED
PlasticitJ2 with EBST VERTICAL benchmarks...
PlasticitJ2 with EBST VERTICAL benchmarks FAILED
PlasticitJ2 with EBST FORCE benchmarks...
PlasticitJ2 with EBST FORCE benchmarks FAILED
Resume of all of the examples for the structural application :
========== Structural Aplication ==========
Patch_Test_Total_Lagrangian_3D_8N: FAILED
Different amount of benchmark data!

Patch_Test_Total_Lagrangian_4N: FAILED
Different amount of benchmark data!

cantilever2dDynamic:FAILED
Different amount of benchmark data!

cantilever2dstatic using MKLPardisoSolver: FAILED
Different amount of benchmark data!

cantilever2dstatic_superlu: FAILED
Different amount of benchmark data!

cantilever2dstatic: FAILED
Different amount of benchmark data!

cantilever2dstatic_parallel:FAILED
Different amount of benchmark data!

cantilever2dstatic using ParallelMKLPardisoSolver: FAILED
Different amount of benchmark data!

cantilever3dstatic: FAILED
Different amount of benchmark data!

cantilever3ddynamic: FAILED
Different amount of benchmark data!

balken contact benchmark: FAILED
Different amount of benchmark data!

arc length desplacement benchmark: FAILED
Different amount of benchmark data!

arc length benchmark: FAILED
Different amount of benchmark data!

Pendulo Kratos Length benchmark: FAILED
Different amount of benchmark data!

PlasticitJ2 with EBST collection benchmarks: FAILED
Different amount of benchmark data!

FAILED
Different amount of benchmark data!

FAILED
Different amount of benchmark data!

FAILED
Different amount of benchmark data!


running the benchmark for naca3d test...
naca3d test example FAILED
running the benchmark for mass_conservation test...
mass_conservation test example FAILED
verifying  test_fractstep_cont_laplacian.py...
test_fractstep_cont_laplacian example FAILED
verifying  test_fractstep_discrete_laplacian.py...
test_fractstep_discrete_laplacian example FAILED
verifying  test_fractstep_cont_laplacian.py...3D
test_fractstep_cont_laplacian 3D example FAILED
Running cylinder.py...
cylinder example FAILED
Running Cilinder GLS example with explicit Runge-Kutta and FRAC STEP...
cilinderGLS example FAILED
Running StillWater_Edgebased...
StillWater_Edgebased example FAILED
Running StillWater_Edgebased_halfPorous...
StillWater_Edgebased_halfPorous example FAILED
Running script.py...
cavity_monolithic_3d example FAILED
running the benchmark for edgebased_fixed_press test...
edgebased_fixed_press test example FAILED
resume of all of the examples for the fluid application :
== Incompressible_Fluid ==========
naca3d test: FAILED
Different amount of benchmark data!

mass conservation test: FAILED
Different amount of benchmark data!

cavity2D: FAILED
Different amount of benchmark data!

FAILED
Different amount of benchmark data!

cavity3D: FAILED
Different amount of benchmark data!

cylinder: FAILED
Different amount of benchmark data!

cilinderGLS: FAILED
Different amount of benchmark data!

StillWater_Edgebased: FAILED
Different amount of benchmark data!

StillWater_Edgebased_halfPorous: FAILED
Different amount of benchmark data!

cavity_monolithic_3d: FAILED
Different amount of benchmark data!

edgebased fixed press test: FAILED
Different amount of benchmark data!


Running edgebased_PureConvection.py...
testConvectionEdgebased example FAILED
Running testPureConvection.py...
testPureConvection example FAILED
resume of all of the examples for the fluid application :
== Convection_Diffusion ==========
square_edgebased: FAILED
Different amount of benchmark data!

pure_convection: FAILED
Different amount of benchmark data!


Running mesh.py...
non-conformant mesh example FAILED
resume of all of the examples for the FSI application :
== FSI_application ==========
meshtest: FAILED
Different amount of benchmark data!


Running mesh.py...
non-conformant mesh example FAILED
resume of all of the examples for the FSI application :
== FSI_application ==========
meshtest: FAILED
Different amount of benchmark data!


running the benchmark for the Activation_test ...
Activation_test example FAILED
resume of all of the examples for the ThermoMechanical Application  :
== ThermoMechanical Application ==========
Activation_test : FAILED
Different amount of benchmark data!


running the benchmark for the Activation_test ...
Activation_test example FAILED
resume of all of the examples for the ThermoMechanical Application  :
== ThermoMechanical Application ==========
Activation_test : FAILED
Different amount of benchmark data!


Running Adaptive Mesher 2d benchmark...
Adaptive_mesher2d benchmarking example FAILED
Running Adaptive Mesher 3d benchmark...
Adaptive_mesher2d benchmarking example FAILED
Running Mapping_2d benchmark...
Mapping_2d benchmarking example FAILED
Running Mapping_3d benchmark...
Mapping_3d benchmarking example FAILED
Running Mapping_2d_BinBased benchmark...
Mapping_2d_BinBased benchmarking example FAILED
Running Mapping_3d_BinBased benchmark...
Mapping_3d_BinBased benchmarking example FAILED
verifying  connectivity_preserve_modeler benchmark...
connectivity_preserve_modeler benchmark FAILED
resume of all of the examples for the meshing application :
========== Meshing Aplication ==========
adaptive_mesher2d: FAILED
Different amount of benchmark data!

adaptive_mesher3d: FAILED
Different amount of benchmark data!

Mapping_2d: FAILED
Different amount of benchmark data!

Mapping_3d: FAILED
Different amount of benchmark data!

Mapping_2d_BinBased: FAILED
Different amount of benchmark data!

Mapping_3d_BinBased: FAILED
Different amount of benchmark data!

connectivity_preserve_modeler benchmark: FAILED
Different amount of benchmark data!


Running Trilinos -- Cantilever_Amesos...
Different amount of benchmark data!
cantilever_amesos.py example FAILED
Running Trilinos -- Cantilever_Aztec...
Different amount of benchmark data!
cantilever_aztec.py example FAILED
Running Trilinos -- Cantilever_ML...
Different amount of benchmark data!
cantilever_ML.py example FAILED
resume of all of the examples for the fluid application :
========== Trilinos Aplication ==========
Trilinos -- Cantilever_Amesos: FAILED
Different amount of benchmark data!

Trilinos -- Cantilever_Aztec: FAILED
Different amount of benchmark data!

Trilinos -- Cantilever_ML (including rotations in null space): FAILED
Different amount of benchmark data!


Status of Kratos examples:

===== Solid Mechanics Application =====
Shell T3 Isotropic  Scordelis  test: FAILED
Different amount of benchmark data!

Shell Q4 Thick Bending  RollUp test: FAILED
Different amount of benchmark data!

Shell Q4 Thick Drilling RollUp test: FAILED
Different amount of benchmark data!

Shell T3 Thin  Bending  RollUp test: FAILED
Different amount of benchmark data!

Shell T3 Thin  Drilling RollUp test: FAILED
Different amount of benchmark data!

== Fluid Dynamics ==========
VMS2D element test: FAILED
Different amount of benchmark data!

Parabolic flow OSS test: FAILED
Different amount of benchmark data!

Slip condition and wall law test: FAILED
Different amount of benchmark data!

Fractional step element test: 2D cavity flow: FAILED
Different amount of benchmark data!

test of cylinder with slip BC, wall law and outlet close to the cylinder: FAILED
Different amount of benchmark data!

========== DEM ==========
DEM element no damp test: FAILED
Different amount of benchmark data!

========== Structural Aplication ==========
Patch_Test_Total_Lagrangian_3D_8N: FAILED
Different amount of benchmark data!

Patch_Test_Total_Lagrangian_4N: FAILED
Different amount of benchmark data!

cantilever2dDynamic:FAILED
Different amount of benchmark data!

cantilever2dstatic using MKLPardisoSolver: FAILED
Different amount of benchmark data!

cantilever2dstatic_superlu: FAILED
Different amount of benchmark data!

cantilever2dstatic: FAILED
Different amount of benchmark data!

cantilever2dstatic_parallel:FAILED
Different amount of benchmark data!

cantilever2dstatic using ParallelMKLPardisoSolver: FAILED
Different amount of benchmark data!

cantilever3dstatic: FAILED
Different amount of benchmark data!

cantilever3ddynamic: FAILED
Different amount of benchmark data!

balken contact benchmark: FAILED
Different amount of benchmark data!

arc length desplacement benchmark: FAILED
Different amount of benchmark data!

arc length benchmark: FAILED
Different amount of benchmark data!

Pendulo Kratos Length benchmark: FAILED
Different amount of benchmark data!

PlasticitJ2 with EBST collection benchmarks: FAILED
Different amount of benchmark data!

FAILED
Different amount of benchmark data!

FAILED
Different amount of benchmark data!

FAILED
Different amount of benchmark data!

== Incompressible_Fluid ==========
naca3d test: FAILED
Different amount of benchmark data!

mass conservation test: FAILED
Different amount of benchmark data!

cavity2D: FAILED
Different amount of benchmark data!

FAILED
Different amount of benchmark data!

cavity3D: FAILED
Different amount of benchmark data!

cylinder: FAILED
Different amount of benchmark data!

cilinderGLS: FAILED
Different amount of benchmark data!

StillWater_Edgebased: FAILED
Different amount of benchmark data!

StillWater_Edgebased_halfPorous: FAILED
Different amount of benchmark data!

cavity_monolithic_3d: FAILED
Different amount of benchmark data!

edgebased fixed press test: FAILED
Different amount of benchmark data!

== Convection_Diffusion ==========
square_edgebased: FAILED
Different amount of benchmark data!

pure_convection: FAILED
Different amount of benchmark data!

== FSI_application ==========
meshtest: FAILED
Different amount of benchmark data!

== ThermoMechanical Application ==========
Activation_test : FAILED
Different amount of benchmark data!

========== Meshing Aplication ==========
adaptive_mesher2d: FAILED
Different amount of benchmark data!

adaptive_mesher3d: FAILED
Different amount of benchmark data!

Mapping_2d: FAILED
Different amount of benchmark data!

Mapping_3d: FAILED
Different amount of benchmark data!

Mapping_2d_BinBased: FAILED
Different amount of benchmark data!

Mapping_3d_BinBased: FAILED
Different amount of benchmark data!

connectivity_preserve_modeler benchmark: FAILED
Different amount of benchmark data!

========== Trilinos Aplication ==========
Trilinos -- Cantilever_Amesos: FAILED
Different amount of benchmark data!

Trilinos -- Cantilever_Aztec: FAILED
Different amount of benchmark data!

Trilinos -- Cantilever_ML (including rotations in null space): FAILED
Different amount of benchmark data!



Benchmarking:

Benchmarking:
### Process ended. ###
------------ próxima parte ------------
Se ha borrado un mensaje que no está en formato texto plano...
Nombre     : gcc_logfile.zip
Tipo       : application/zip
Tamaño     : 6291 bytes
Descripción: no disponible
Url        : http://listas.cimne.upc.edu/pipermail/kratos/attachments/20141004/80c01f60/attachment-0001.zip 


Más información sobre la lista de distribución Kratos