[Kratos] Kratos Nigthly Report - gcc

Kratos Benchmarking kratos-no-reply en cimne.upc.edu
Sab Mayo 31 01:36:51 CEST 2014


--- Kratos Benchmarking Tests ---
This is an automatically generated e-mail with the nightly tests of 31-05-14.0000.

### This is a GCC compilation/benchmarking ###

--------------------GCC Compiling Status--------------------- 

Failed Applications : 0
Compiling Errors    : 0
Compiling Warnings  : 26
/data0/auto-test/kratos-code/kratos/containers/array_1d.h:325: warning: array subscript is above array bounds
/data0/auto-test/kratos-code/kratos/containers/array_1d.h:325: warning: array subscript is above array bounds
/data0/auto-test/kratos-code/kratos/containers/array_1d.h:325: warning: array subscript is above array bounds
/data0/auto-test/kratos-code/kratos/containers/array_1d.h:325: warning: array subscript is above array bounds
/data0/compiled_libraries/boost/include/boost/numeric/ublas/functional.hpp:694: warning: ‘dxprim12’ may be used uninitialized in this function
/data0/compiled_libraries/boost/include/boost/numeric/ublas/functional.hpp:694: warning: ‘dxprim32’ may be used uninitialized in this function
/data0/compiled_libraries/boost/include/boost/numeric/ublas/functional.hpp:694: warning: ‘dvprim12’ may be used uninitialized in this function
/usr/include/python2.6/pyconfig-64.h:1034:1: warning: "_POSIX_C_SOURCE" redefined
/usr/include/features.h:162:1: warning: this is the location of the previous definition
/usr/include/python2.6/pyconfig-64.h:1043:1: warning: "_XOPEN_SOURCE" redefined
/usr/include/features.h:164:1: warning: this is the location of the previous definition
/data0/auto-test/kratos-code/applications/incompressible_fluid_application/custom_utilities/embedded_utilities.h:105: warning: ‘IntersectionVel.Kratos::array_1d<double, 3ul>::data_.boost::array<double, 3ul>::elems[0u]’ may be used uninitialized in this function
/data0/auto-test/kratos-code/applications/incompressible_fluid_application/custom_utilities/embedded_utilities.h:105: warning: ‘IntersectionVel.Kratos::array_1d<double, 3ul>::data_.boost::array<double, 3ul>::elems[2u]’ may be used uninitialized in this function
/data0/auto-test/kratos-code/applications/incompressible_fluid_application/custom_utilities/embedded_utilities.h:105: warning: ‘IntersectionVel.Kratos::array_1d<double, 3ul>::data_.boost::array<double, 3ul>::elems[1u]’ may be used uninitialized in this function
/data0/auto-test/kratos-code/applications/FluidDynamicsApplication/custom_conditions/generalized_wall_condition.h:668: warning: ‘D’ may be used uninitialized in this function
/data0/auto-test/kratos-code/applications/FluidDynamicsApplication/custom_conditions/generalized_wall_condition.h:668: warning: ‘E’ may be used uninitialized in this function
/data0/auto-test/kratos-code/applications/FluidDynamicsApplication/custom_conditions/generalized_wall_condition.h:668: warning: ‘D’ may be used uninitialized in this function
/data0/auto-test/kratos-code/applications/FluidDynamicsApplication/custom_conditions/generalized_wall_condition.h:668: warning: ‘E’ may be used uninitialized in this function
/data0/auto-test/kratos-code/applications/ALEapplication/custom_elements/structural_meshmoving_element_2d.cpp:200: warning: array subscript is above array bounds
/data0/auto-test/kratos-code/applications/ALEapplication/custom_elements/structural_meshmoving_element_2d.cpp:206: warning: array subscript is above array bounds
/data0/auto-test/kratos-code/applications/ALEapplication/custom_elements/laplacian_componentwise_meshmoving_element_2d_strainbased.cpp:169: warning: array subscript is above array bounds
/data0/auto-test/kratos-code/applications/OpenCLapplication/spatial_containers/bins_object_static_OCL.h:980: warning: comparison between signed and unsigned integer expressions
/data0/auto-test/kratos-code/applications/ThermoMechanicalApplication/custom_utilities/biphasic_filling_utilities.h:428: warning: unused variable ‘net_input’
/data0/auto-test/kratos-code/applications/ThermoMechanicalApplication/custom_processes/DPG_copy_to_vulcan_post_variables_process.h:214: warning: unused variable ‘slip_falg’
/data0/auto-test/kratos-code/applications/ALEapplication/custom_elements/structural_meshmoving_element_2d.cpp:200: warning: array subscript is above array bounds
/data0/auto-test/kratos-code/applications/ALEapplication/custom_elements/structural_meshmoving_element_2d.cpp:206: warning: array subscript is above array bounds
Linking Error       : 0
running the Shell Q4 Thick Bending RollUp benchmark test...
Shell Q4 Thick Bending RollUp test FAILED
running the Shell Q4 Thick Drilling RollUp benchmark test...
Shell Q4 Thick Drilling RollUp test FAILED
running the Shell T3 Thin Bending RollUp benchmark test...
Shell T3 Thin Bending RollUp test FAILED
running the Shell T3 Thin Drilling RollUp benchmark test...
Shell T3 Thin Drilling RollUp test FAILED
---end solid mechanics application tests---
resume of all of the examples for the SolidMechanicsApplication :
===== Solid Mechanics Application =====
Shell Q4 Thick Bending  RollUp test: FAILED
Different amount of benchmark data!

Shell Q4 Thick Drilling RollUp test: FAILED
Different amount of benchmark data!

Shell T3 Thin  Bending  RollUp test: FAILED
Different amount of benchmark data!

Shell T3 Thin  Drilling RollUp test: FAILED
Different amount of benchmark data!


running the vms2d_test benchmark test...
VMS2D element test successful
Running VMS test: parabolic flow in a trapezoidal domain solved using OSS

Benchmarking:

Benchmarking:
### Process ended. ###
------------ prxima parte ------------
Se ha borrado un mensaje que no está en formato texto plano...
Nombre     : gcc_logfile.zip
Tipo       : application/zip
Tamaño     : 8532 bytes
Descripción: no disponible
Url        : http://listas.cimne.upc.edu/pipermail/kratos/attachments/20140531/507b23d6/attachment.zip 


Ms informacin sobre la lista de distribucin Kratos