[Kratos] Kratos Nigthly Report - clang

Kratos Benchmarking kratos-no-reply en cimne.upc.edu
Sab Mayo 31 00:35:54 CEST 2014


--- Kratos Benchmarking Tests ---
This is an automatically generated e-mail with the nightly tests of 31-05-14.0000.

### This is a CLANG compilation/benchmarking ###

--------------------Compiling Status--------------------- 

Failed Applications : 0
Compiling Errors    : 0
Compiling Warnings  : 10
/data0/auto-test/kratos-code/applications/ExternalSolversApplication/custom_external_libraries/ITSOL_2/SRC/sets.c:19:19: warning: format string is not a string literal (potentially insecure) [-Wformat-security]
1 warning generated.
/data0/auto-test/kratos-code/applications/MeshingApplication/custom_external_libraries/msuite/src/malla/meshelm.cpp:1822:29: warning: add explicit braces to avoid dangling else [-Wdangling-else]
1 warning generated.
/usr/include/python2.6/pyconfig-64.h:1034:9: warning: '_POSIX_C_SOURCE' macro redefined
/usr/include/python2.6/pyconfig-64.h:1043:9: warning: '_XOPEN_SOURCE' macro redefined
2 warnings generated.
/data0/auto-test/kratos-code/applications/OpenCLapplication/custom_external_libraries/pugixml/src/pugixml.cpp:5678:42: warning: adding 'bool' to a string does not append to the string [-Wstring-plus-int]
/data0/auto-test/kratos-code/applications/OpenCLapplication/custom_external_libraries/pugixml/src/pugixml.cpp:5678:42: note: use array indexing to silence this warning
1 warning generated.
Linking Error       : 0
running the Shell Q4 Thick Bending RollUp benchmark test...
Shell Q4 Thick Bending RollUp test FAILED
running the Shell Q4 Thick Drilling RollUp benchmark test...
Shell Q4 Thick Drilling RollUp test FAILED
running the Shell T3 Thin Bending RollUp benchmark test...
Shell T3 Thin Bending RollUp test FAILED
running the Shell T3 Thin Drilling RollUp benchmark test...
Shell T3 Thin Drilling RollUp test FAILED
---end solid mechanics application tests---
resume of all of the examples for the SolidMechanicsApplication :
===== Solid Mechanics Application =====
Shell Q4 Thick Bending  RollUp test: FAILED
Different amount of benchmark data!

Shell Q4 Thick Drilling RollUp test: FAILED
Different amount of benchmark data!

Shell T3 Thin  Bending  RollUp test: FAILED
Different amount of benchmark data!

Shell T3 Thin  Drilling RollUp test: FAILED
Different amount of benchmark data!


running the vms2d_test benchmark test...
VMS2D element test successful
Running VMS test: parabolic flow in a trapezoidal domain solved using OSS

Benchmarking:

Benchmarking:
### Process ended. ###
------------ próxima parte ------------
Se ha borrado un mensaje que no está en formato texto plano...
Nombre     : clang_logfile.zip
Tipo       : application/zip
Tamaño     : 8134 bytes
Descripción: no disponible
Url        : http://listas.cimne.upc.edu/pipermail/kratos/attachments/20140531/9e6bd0a2/attachment-0001.zip 


Más información sobre la lista de distribución Kratos