[Kratos] Kratos Nigthly Report - clang

Kratos Benchmarking kratos-no-reply en cimne.upc.edu
Lun Jul 28 01:01:56 CEST 2014


--- Kratos Benchmarking Tests ---
This is an automatically generated e-mail with the nightly tests of 28-07-14.0000.

### This is a CLANG compilation/benchmarking ###

--------------------Compiling Status--------------------- 

Failed Applications : 0
Compiling Errors    : 0
Compiling Warnings  : 10
/data0/auto-test/kratos-code/applications/ExternalSolversApplication/custom_external_libraries/ITSOL_2/SRC/sets.c:19:19: warning: format string is not a string literal (potentially insecure) [-Wformat-security]
1 warning generated.
/data0/auto-test/kratos-code/applications/MeshingApplication/custom_external_libraries/msuite/src/malla/meshelm.cpp:1822:29: warning: add explicit braces to avoid dangling else [-Wdangling-else]
1 warning generated.
/usr/include/python2.6/pyconfig-64.h:1034:9: warning: '_POSIX_C_SOURCE' macro redefined
/usr/include/python2.6/pyconfig-64.h:1043:9: warning: '_XOPEN_SOURCE' macro redefined
2 warnings generated.
/data0/auto-test/kratos-code/applications/OpenCLapplication/custom_external_libraries/pugixml/src/pugixml.cpp:5678:42: warning: adding 'bool' to a string does not append to the string [-Wstring-plus-int]
/data0/auto-test/kratos-code/applications/OpenCLapplication/custom_external_libraries/pugixml/src/pugixml.cpp:5678:42: note: use array indexing to silence this warning
1 warning generated.
Linking Error       : 0
---start solid mechanics application tests---
running the Scordelis Low Roof benchmark test...
Scordelis Low Roof test successful
running the Shell Q4 Thick Bending RollUp benchmark test...
Shell Q4 Thick Bending RollUp test successful
running the Shell Q4 Thick Drilling RollUp benchmark test...
Shell Q4 Thick Drilling RollUp test successful
running the Shell T3 Thin Bending RollUp benchmark test...
Shell T3 Thin Bending RollUp test successful
running the Shell T3 Thin Drilling RollUp benchmark test...
Shell T3 Thin Drilling RollUp test successful
---end solid mechanics application tests---
resume of all of the examples for the SolidMechanicsApplication :
===== Solid Mechanics Application =====
Shell T3 Isotropic  Scordelis  test: OK
Shell Q4 Thick Bending  RollUp test: OK
Shell Q4 Thick Drilling RollUp test: OK
Shell T3 Thin  Bending  RollUp test: OK
Shell T3 Thin  Drilling RollUp test: OK

running the vms2d_test benchmark test...
Difference found in reference and test data:
 abs(ref_data - test_data) 77.199356015
 absolute_tol 2.42350993406e-09
 abs(ref_data - test_data) 77.199356015
 abs(ref_data ) 2423.50993406
 abs(ref_data - test_data)/abs(ref_data ) 0.0318543592209
 relative_tol 0.01
Reference:['KRATOS_BENCHMARK', 'Float', 'Test node 1 pressure', '2.423509934062E+03', 'None', '0.01']
Test:     ['KRATOS_BENCHMARK', 'Float', 'Test node 1 pressure', '2.500709290077E+03', 'None', '0.01']
VMS2D element test FAILED
Running VMS test: parabolic flow in a trapezoidal domain solved using OSS
Difference found in reference and test data:
 abs(ref_data - test_data) 4.19861322233e-05
 absolute_tol 1e-12
 abs(ref_data - test_data) 4.19861322233e-05
 abs(ref_data ) 0.0
 relative_tol 0.001
Reference:['KRATOS_BENCHMARK', 'Float', 'x velocity at center node', '0.000', 'None', '0.001']
Test:     ['KRATOS_BENCHMARK', 'Float', 'x velocity at center node', '-4.198613222334E-05', 'None', '0.001']
oss_trapezoid test FAILED
Running slip condition test...
Difference found in reference and test data:
 abs(ref_data - test_data) 8.5312222e-07
 absolute_tol 1.96331431583e-14
 abs(ref_data - test_data) 8.5312222e-07
 abs(ref_data ) 0.0196331431583
 abs(ref_data - test_data)/abs(ref_data ) 4.34531655538e-05
 relative_tol 1e-05
Reference:['KRATOS_BENCHMARK', 'Float', 'x velocity at node 303', '1.963314315833E-02', 'None', '1e-05']
Test:     ['KRATOS_BENCHMARK', 'Float', 'x velocity at node 303', '1.963399628055E-02', 'None', '1e-05']
slip condition test FAILED
Running Fractional step element test: 2D cavity flow
Fractional step 2D cavity test FAILED
Running test of cylinder with slip BC, wall law and outlet close to the cylinder
cylinder with slip BC, wall law and outlet test FAILED
resume of all of the examples for the Fluid Dynamics application :
== Fluid Dynamics ==========
VMS2D element test: FAILED
Difference found in reference and test data:
 abs(ref_data - test_data) 77.199356015
 absolute_tol 2.42350993406e-09
 abs(ref_data - test_data) 77.199356015
 abs(ref_data ) 2423.50993406
 abs(ref_data - test_data)/abs(ref_data ) 0.0318543592209
 relative_tol 0.01
Reference:['KRATOS_BENCHMARK', 'Float', 'Test node 1 pressure', '2.423509934062E+03', 'None', '0.01']
Test:     ['KRATOS_BENCHMARK', 'Float', 'Test node 1 pressure', '2.500709290077E+03', 'None', '0.01']

Parabolic flow OSS test: FAILED
Difference found in reference and test data:
 abs(ref_data - test_data) 4.19861322233e-05
 absolute_tol 1e-12
 abs(ref_data - test_data) 4.19861322233e-05
 abs(ref_data ) 0.0
 relative_tol 0.001
Reference:['KRATOS_BENCHMARK', 'Float', 'x velocity at center node', '0.000', 'None', '0.001']
Test:     ['KRATOS_BENCHMARK', 'Float', 'x velocity at center node', '-4.198613222334E-05', 'None', '0.001']

Slip condition and wall law test: FAILED
Difference found in reference and test data:
 abs(ref_data - test_data) 8.5312222e-07
 absolute_tol 1.96331431583e-14
 abs(ref_data - test_data) 8.5312222e-07
 abs(ref_data ) 0.0196331431583
 abs(ref_data - test_data)/abs(ref_data ) 4.34531655538e-05
 relative_tol 1e-05
Reference:['KRATOS_BENCHMARK', 'Float', 'x velocity at Warning: couldn't find xdpyinfo to determine GLX availability. 
Configuring GiD for Software Rendering
node 303', '1.963314315833E-02', 'None', '1e-05']
Test:     ['KRATOS_BENCHMARK', 'Float', 'x velocity at node 303', '1.963399628055E-02', 'None', '1e-05']

Fractional step element test: 2D cavity flow: FAILED


test of cylinder with slip BC, wall law and outlet close to the cylinder: FAILED



Problem updated...
Python script updated...
running the DEM two_balls_no_damp test...
two_balls_no_damp example test FAILED
resume of all of the examples for the DEM application :
========== DEM ==========
DEM element no damp test: FAILED
Different amount of benchmark data!


Running Patch_Test_Total_Lagrangian_3D_8N...
Patch_Test_Total_Lagrangian_3D_8N_benchmarking example successful
Running Patch_Test_Total_Lagrangian_4N...
Patch_Test_Total_Lagrangian_4N_benchmarking example successful
Running cantilever2ddynamic
cantilever2dynamic successful
Running cantilever2dstatic using MKLPardisoSolver
Expected fail because the  program should be compiled with INTEL compliler.
Running cantilever2dstatic witdh SuperLUSolver
cantilever2dstatic witdh SuperLUSolver example successful
Running cantilever2dstatic with classical solver
cantilever2dstatic with classical solver example successful
Running cantilever2dstatic_parallel using ParallelSkylineLUFactorizationSolver
Expected fail because the  program should be compiled with INTEL compliler.
Running cantilever2dstatic using ParallelMKLPardisoSolver
Expected fail because the  program should be compiled with INTEL compliler.
Running cantilever3dstatic
cantilever3dstatic example successful
Running cantilever3dynamic
cantilever3ddynamic example successful
Running balken contact benchmark...
balken contact benchmark example FAILED
Running arc length desplacement  benchmark...
arc_length_des benchmark example successful
Running arc length  benchmark...
Difference found in reference and test data:
 abs(ref_data - test_data) 1.06363823432
 absolute_tol 1.0
 abs(ref_data - test_data) 1.06363823432
 abs(ref_data ) 4.87503539448
 abs(ref_data - test_data)/abs(ref_data ) 0.218180617831
 relative_tol None
Reference:['KRATOS_BENCHMARK', 'Float', 'Node 1 Force_y', '-4.87503539448', '1.0', 'None']
Test:     ['KRATOS_BENCHMARK', 'Float', 'Node 1 Force_y', '-3.811397160163E+00', '1.0', 'None']
arc_length benchmark example FAILED
Pendulo Kratos Length benchmark...
Pendulo Kratos benchmark example successful
PlasticitJ2 with EBST TENSION benchmarks...
PlasticitJ2 with EBST TENSION benchmarks successful
PlasticitJ2 with EBST TORSION benchmarks...
PlasticitJ2 with EBST TORSION benchmarks successful
PlasticitJ2 with EBST VERTICAL benchmarks...
PlasticitJ2 with EBST VERTICAL benchmarks successful
PlasticitJ2 with EBST FORCE benchmarks...
PlasticitJ2 with EBST FORCE benchmarks successful
Resume of all of the examples for the structural application :
========== Structural Aplication ==========
Patch_Test_Total_Lagrangian_3D_8N: OK
Patch_Test_Total_Lagrangian_4N: OK
cantilever2dDynamic:OK
cantilever2dstatic using MKLPardisoSolver: FAILED
Different amount of benchmark data!

cantilever2dstatic_superlu: OK
cantilever2dstatic: OK
cantilever2dstatic_parallel:FAILED
Different amount of benchmark data!

cantilever2dstatic using ParallelMKLPardisoSolver: FAILED
Different amount of benchmark data!

cantilever3dstatic: OK
cantilever3ddynamic: OK
balken contact benchmark: FAILED
Different amount of benchmark data!

arc length desplacement benchmark: OK
arc length benchmark: FAILED
Difference found in reference and test data:
 abs(ref_data - test_data) 1.06363823432
 absolute_tol 1.0
 abs(ref_data - test_data) 1.06363823432
 abs(ref_data ) 4.87503539448
 abs(ref_data - test_data)/abs(ref_data ) 0.218180617831
 relative_tol None
Reference:['KRATOS_BENCHMARK', 'Float', 'Node 1 Force_y', '-4.87503539448', '1.0', 'None']
Test:     ['KRATOS_BENCHMARK', 'Float', 'Node 1 Force_y', '-3.811397160163E+00', '1.0', 'None']

Pendulo Kratos Length benchmark: OK
PlasticitJ2 with EBST collection benchmarks: OK
OK
OK
OK

running the benchmark for naca3d test...
naca3d test example successful
running the benchmark for mass_conservation test...
mass_conservation test example successful
verifying  test_fractstep_cont_laplacian.py...
test_fractstep_cont_laplacian example successful
verifying  test_fractstep_discrete_laplacian.py...
test_fractstep_discrete_laplacian example successful
verifying  test_fractstep_cont_laplacian.py...3D
test_fractstep_cont_laplacian 3D example successful
Running cylinder.py...
cylinder example successful
Running Cilinder GLS example with explicit Runge-Kutta and FRAC STEP...
cilinderGLS example FAILED
Running StillWater_Edgebased...
StillWater_Edgebased example successful
Running StillWater_Edgebased_halfPorous...
StillWater_Edgebased_halfPorous example successful
Running script.py...
cavity_monolithic_3d example successful
running the benchmark for edgebased_fixed_press test...
Difference found in reference and test data:
 abs(ref_data - test_data) 0.00026564320377
 absolute_tol 2.62647460635e-14
 abs(ref_data - test_data) 0.00026564320377
 abs(ref_data ) 0.0262647460635
 abs(ref_data - test_data)/abs(ref_data ) 0.0101140594745
 relative_tol 0.01
Reference:['KRATOS_BENCHMARK', 'Float', 'distance on node 2215', '-0.0262647460635', 'None', '0.01']
Test:     ['KRATOS_BENCHMARK', 'Float', 'distance on node 2215', '-2.653038926727E-02', 'None', '0.01']
edgebased_fixed_press test example FAILED
resume of all of the examples for the fluid application :
== Incompressible_Fluid ==========
naca3d test: OK
mass conservation test: OK
cavity2D: OK
OK
cavity3D: OK
cylinder: OK
cilinderGLS: FAILED
Different amount of benchmark data!

StillWater_Edgebased: OK
StillWater_Edgebased_halfPorous: OK
cavity_monolithic_3d: OK
edgebased fixed press test: FAILED
Difference found in reference and test data:
 abs(ref_data - test_data) 0.00026564320377
 absolute_tol 2.62647460635e-14
 abs(ref_data - test_data) 0.00026564320377
 abs(ref_data ) 0.0262647460635
 abs(ref_data - test_data)/abs(ref_data ) 0.0101140594745
 relative_tol 0.01
Reference:['KRATOS_BENCHMARK', 'Float', 'distance on node 2215', '-0.0262647460635', 'None', '0.01']
Test:     ['KRATOS_BENCHMARK', 'Float', 'distance on node 2215', '-2.653038926727E-02', 'None', '0.01']


Running edgebased_PureConvection.py...
Difference found in reference and test data:
 abs(ref_data - test_data) 4.0002723356e-14
 absolute_tol 3.41404407683e-14
 abs(ref_data - test_data) 4.0002723356e-14
 abs(ref_data ) 0.0341404407683
 abs(ref_data - test_data)/abs(ref_data ) 1.1717108056e-12
 relative_tol None
Reference:['KRATOS_BENCHMARK', 'Float', 'Time', '0.0341404407683', 'None', 'None']
Test:     ['KRATOS_BENCHMARK', 'Float', 'Time', '3.414044076826E-02', '1e-07', 'None']
testConvectionEdgebased example FAILED
Running testPureConvection.py...
testPureConvection example FAILED
resume of all of the examples for the fluid application :
== Convection_Diffusion ==========
square_edgebased: FAILED
Difference found in reference and test data:
 abs(ref_data - test_data) 4.0002723356e-14
 absolute_tol 3.41404407683e-14
 abs(ref_data - test_data) 4.0002723356e-14
 abs(ref_data ) 0.0341404407683
 abs(ref_data - test_data)/abs(ref_data ) 1.1717108056e-12
 relative_tol None
Reference:['KRATOS_BENCHMARK', 'Float', 'Time', '0.0341404407683', 'None', 'None']
Test:     ['KRATOS_BENCHMARK', 'Float', 'Time', '3.414044076826E-02', '1e-07', 'None']

pure_convection: FAILED
Different amount of benchmark data!


Running mesh.py...
Difference found in reference and test data:
 abs(ref_data - test_data) 3.00003077935e-14
 absolute_tol 1.77698035412e-14
 abs(ref_data - test_data) 3.00003077935e-14
 abs(ref_data ) 0.0177698035412
 abs(ref_data - test_data)/abs(ref_data ) 1.68827459032e-12
 relative_tol None
Reference:['KRATOS_BENCHMARK', 'Float', 'Difference in x velocity in test point 2', '-0.0177698035412', 'None', 'None']
Test:     ['KRATOS_BENCHMARK', 'Float', 'Difference in x velocity in test point 2', '-1.776980354117E-02', 'None', 'None']
non-conformant mesh example FAILED
resume of all of the examples for the FSI application :
== FSI_application ==========
meshtest: FAILED
Difference found in reference and test data:
 abs(ref_data - test_data) 3.00003077935e-14
 absolute_tol 1.77698035412e-14
 abs(ref_data - test_data) 3.00003077935e-14
 abs(ref_data ) 0.0177698035412
 abs(ref_data - test_data)/abs(ref_data ) 1.68827459032e-12
 relative_tol None
Reference:['KRATOS_BENCHMARK', 'Float', 'Difference in x velocity in test point 2', '-0.0177698035412', 'None', 'None']
Test:     ['KRATOS_BENCHMARK', 'Float', 'Difference in x velocity in test point 2', '-1.776980354117E-02', 'None', 'None']


Running mesh.py...
Difference found in reference and test data:
 abs(ref_data - test_data) 3.00003077935e-14
 absolute_tol 1.77698035412e-14
 abs(ref_data - test_data) 3.00003077935e-14
 abs(ref_data ) 0.0177698035412
 abs(ref_data - test_data)/abs(ref_data ) 1.68827459032e-12
 relative_tol None
Reference:['KRATOS_BENCHMARK', 'Float', 'Difference in x velocity in test point 2', '-0.0177698035412', 'None', 'None']
Test:     ['KRATOS_BENCHMARK', 'Float', 'Difference in x velocity in test point 2', '-1.776980354117E-02', 'None', 'None']
non-conformant mesh example FAILED
resume of all of the examples for the FSI application :
== FSI_application ==========
meshtest: FAILED
Difference found in reference and test data:
 abs(ref_data - test_data) 3.00003077935e-14
 absolute_tol 1.77698035412e-14
 abs(ref_data - test_data) 3.00003077935e-14
 abs(ref_data ) 0.0177698035412
 abs(ref_data - test_data)/abs(ref_data ) 1.68827459032e-12
 relative_tol None
Reference:['KRATOS_BENCHMARK', 'Float', 'Difference in x velocity in test point 2', '-0.0177698035412', 'None', 'None']
Test:     ['KRATOS_BENCHMARK', 'Float', 'Difference in x velocity in test point 2', '-1.776980354117E-02', 'None', 'None']


running the benchmark for the Activation_test ...
Activation_test example FAILED
resume of all of the examples for the ThermoMechanical Application  :
== ThermoMechanical Application ==========
Activation_test : FAILED
Different amount of benchmark data!


running the benchmark for the Activation_test ...
Activation_test example FAILED
resume of all of the examples for the ThermoMechanical Application  :
== ThermoMechanical Application ==========
Activation_test : FAILED
Different amount of benchmark data!


Running Adaptive Mesher 2d benchmark...
Adaptive_mesher2d benchmarking example successful
Running Adaptive Mesher 3d benchmark...
Adaptive_mesher2d benchmarking example successful
Running Mapping_2d benchmark...
Mapping_2d benchmarking example successful
Running Mapping_3d benchmark...
Mapping_3d benchmarking example successful
Running Mapping_2d_BinBased benchmark...
Mapping_2d_BinBased benchmarking example successful
Running Mapping_3d_BinBased benchmark...
Mapping_3d_BinBased benchmarking example successful
verifying  connectivity_preserve_modeler benchmark...
connectivity_preserve_modeler benchmark FAILED
resume of all of the examples for the meshing application :
========== Meshing Aplication ==========
adaptive_mesher2d: OK
adaptive_mesher3d: OK
Mapping_2d: OK
Mapping_3d: OK
Mapping_2d_BinBased: OK
Mapping_3d_BinBased: OK
connectivity_preserve_modeler benchmark: FAILED
Different amount of benchmark data!


Running Trilinos -- Cantilever_Amesos...
Different amount of benchmark data!
cantilever_amesos.py example FAILED
Running Trilinos -- Cantilever_Aztec...
cantilever_aztec.py example FAILED
Running Trilinos -- Cantilever_ML...
cantilever_ML.py example FAILED
resume of all of the examples for the fluid application :
========== Trilinos Aplication ==========
Trilinos -- Cantilever_Amesos: FAILED
Different amount of benchmark data!

Trilinos -- Cantilever_Aztec: FAILED


Trilinos -- Cantilever_ML (including rotations in null space): FAILED



Status of Kratos examples:

===== Solid Mechanics Application =====
Shell T3 Isotropic  Scordelis  test: OK
Shell Q4 Thick Bending  RollUp test: OK
Shell Q4 Thick Drilling RollUp test: OK
Shell T3 Thin  Bending  RollUp test: OK
Shell T3 Thin  Drilling RollUp test: OK
== Fluid Dynamics ==========
VMS2D element test: FAILED
Difference found in reference and test data:
 abs(ref_data - test_data) 77.199356015
 absolute_tol 2.42350993406e-09
 abs(ref_data - test_data) 77.199356015
 abs(ref_data ) 2423.50993406
 abs(ref_data - test_data)/abs(ref_data ) 0.0318543592209
 relative_tol 0.01
Reference:['KRATOS_BENCHMARK', 'Float', 'Test node 1 pressure', '2.423509934062E+03', 'None', '0.01']
Test:     ['KRATOS_BENCHMARK', 'Float', 'Test node 1 pressure', '2.500709290077E+03', 'None', '0.01']

Parabolic flow OSS test: FAILED
Difference found in reference and test data:
 abs(ref_data - test_data) 4.19861322233e-05
 absolute_tol 1e-12
 abs(ref_data - test_data) 4.19861322233e-05
 abs(ref_data ) 0.0
 relative_tol 0.001
Reference:['KRATOS_BENCHMARK', 'Float', 'x velocity at center node', '0.000', 'None', '0.001']
Test:     ['KRATOS_BENCHMARK', 'Float', 'x velocity at center node', '-4.198613222334E-05', 'None', '0.001']

Slip condition and wall law test: FAILED
Difference found in reference and test data:
 abs(ref_data - test_data) 8.5312222e-07
 absolute_tol 1.96331431583e-14
 abs(ref_data - test_data) 8.5312222e-07
 abs(ref_data ) 0.0196331431583
 abs(ref_data - test_data)/abs(ref_data ) 4.34531655538e-05
 relative_tol 1e-05
Reference:['KRATOS_BENCHMARK', 'Float', 'x velocity at node 303', '1.963314315833E-02', 'None', '1e-05']
Test:     ['KRATOS_BENCHMARK', 'Float', 'x velocity at node 303', '1.963399628055E-02', 'None', '1e-05']

Fractional step element test: 2D cavity flow: FAILED


test of cylinder with slip BC, wall law and outlet close to the cylinder: FAILED


========== DEM ==========
DEM element no damp test: FAILED
Different amount of benchmark data!

========== Structural Aplication ==========
Patch_Test_Total_Lagrangian_3D_8N: OK
Patch_Test_Total_Lagrangian_4N: OK
cantilever2dDynamic:OK
cantilever2dstatic using MKLPardisoSolver: FAILED
Different amount of benchmark data!

cantilever2dstatic_superlu: OK
cantilever2dstatic: OK
cantilever2dstatic_parallel:FAILED
Different amount of benchmark data!

cantilever2dstatic using ParallelMKLPardisoSolver: FAILED
Different amount of benchmark data!

cantilever3dstatic: OK
cantilever3ddynamic: OK
balken contact benchmark: FAILED
Different amount of benchmark data!

arc length desplacement benchmark: OK
arc length benchmark: FAILED
Difference found in reference and test data:
 abs(ref_data - test_data) 1.06363823432
 absolute_tol 1.0
 abs(ref_data - test_data) 1.06363823432
 abs(ref_data ) 4.87503539448
 abs(ref_data - test_data)/abs(ref_data ) 0.218180617831
 relative_tol None
Reference:['KRATOS_BENCHMARK', 'Float', 'Node 1 Force_y', '-4.87503539448', '1.0', 'None']
Test:     ['KRATOS_BENCHMARK', 'Float', 'Node 1 Force_y', '-3.811397160163E+00', '1.0', 'None']

Pendulo Kratos Length benchmark: OK
PlasticitJ2 with EBST collection benchmarks: OK
OK
OK
OK
== Incompressible_Fluid ==========
naca3d test: OK
mass conservation test: OK
cavity2D: OK
OK
cavity3D: OK
cylinder: OK
cilinderGLS: FAILED
Different amount of benchmark data!

StillWater_Edgebased: OK
StillWater_Edgebased_halfPorous: OK
cavity_monolithic_3d: OK
edgebased fixed press test: FAILED
Difference found in reference and test data:
 abs(ref_data - test_data) 0.00026564320377
 absolute_tol 2.62647460635e-14
 abs(ref_data - test_data) 0.00026564320377
 abs(ref_data ) 0.0262647460635
 abs(ref_data - test_data)/abs(ref_data ) 0.0101140594745
 relative_tol 0.01
Reference:['KRATOS_BENCHMARK', 'Float', 'distance on node 2215', '-0.0262647460635', 'None', '0.01']
Test:     ['KRATOS_BENCHMARK', 'Float', 'distance on node 2215', '-2.653038926727E-02', 'None', '0.01']

== Convection_Diffusion ==========
square_edgebased: FAILED
Difference found in reference and test data:
 abs(ref_data - test_data) 4.0002723356e-14
 absolute_tol 3.41404407683e-14
 abs(ref_data - test_data) 4.0002723356e-14
 abs(ref_data ) 0.0341404407683
 abs(ref_data - test_data)/abs(ref_data ) 1.1717108056e-12
 relative_tol None
Reference:['KRATOS_BENCHMARK', 'Float', 'Time', '0.0341404407683', 'None', 'None']
Test:     ['KRATOS_BENCHMARK', 'Float', 'Time', '3.414044076826E-02', '1e-07', 'None']

pure_convection: FAILED
Different amount of benchmark data!

== FSI_application ==========
meshtest: FAILED
Difference found in reference and test data:
 abs(ref_data - test_data) 3.00003077935e-14
 absolute_tol 1.77698035412e-14
 abs(ref_data - test_data) 3.00003077935e-14
 abs(ref_data ) 0.0177698035412
 abs(ref_data - test_data)/abs(ref_data ) 1.68827459032e-12
 relative_tol None
Reference:['KRATOS_BENCHMARK', 'Float', 'Difference in x velocity in test point 2', '-0.0177698035412', 'None', 'None']
Test:     ['KRATOS_BENCHMARK', 'Float', 'Difference in x velocity in test point 2', '-1.776980354117E-02', 'None', 'None']

== ThermoMechanical Application ==========
Activation_test : FAILED
Different amount of benchmark data!

========== Meshing Aplication ==========
adaptive_mesher2d: OK
adaptive_mesher3d: OK
Mapping_2d: OK
Mapping_3d: OK
Mapping_2d_BinBased: OK
Mapping_3d_BinBased: OK
connectivity_preserve_modeler benchmark: FAILED
Different amount of benchmark data!

========== Trilinos Aplication ==========
Trilinos -- Cantilever_Amesos: FAILED
Different amount of benchmark data!

Trilinos -- Cantilever_Aztec: FAILED


Trilinos -- Cantilever_ML (including rotations in null space): FAILED




Benchmarking:

Benchmarking:
### Process ended. ###
------------ próxima parte ------------
Se ha borrado un mensaje que no está en formato texto plano...
Nombre     : clang_logfile.zip
Tipo       : application/zip
Tamaño     : 8890 bytes
Descripción: no disponible
Url        : http://listas.cimne.upc.edu/pipermail/kratos/attachments/20140728/ca49ceb4/attachment-0001.zip 


Más información sobre la lista de distribución Kratos