[Kratos] Kratos Nigthly Report - clang

Kratos Benchmarking kratos-no-reply en cimne.upc.edu
Vie Ago 3 01:19:06 CEST 2012


--- Kratos Benchmarking Tests ---
This is an automatically generated e-mail with the nightly tests of 03-08-12.0000.

### This is a CLANG compilation/benchmarking ###

--------------------Compiling Status--------------------- 

Failed Applications : 0
Compiling Errors    : 24
/data0/auto-test/kratos-code/applications/structural_application/custom_strategies/builder_and_solvers/multiphase_builder_and_solver.h:1941:34: error: use of undeclared identifier 'mpG'
/data0/auto-test/kratos-code/applications/structural_application/custom_strategies/builder_and_solvers/multiphase_builder_and_solver.h:1942:34: error: use of undeclared identifier 'mpD'
/data0/auto-test/kratos-code/applications/structural_application/custom_strategies/builder_and_solvers/multiphase_builder_and_solver.h:1943:34: error: use of undeclared identifier 'mpL'
/data0/auto-test/kratos-code/applications/structural_application/custom_strategies/builder_and_solvers/multiphase_builder_and_solver.h:1950:15: error: use of undeclared identifier 'OuterIt'
/data0/auto-test/kratos-code/applications/structural_application/custom_strategies/builder_and_solvers/multiphase_builder_and_solver.h:1951:17: error: use of undeclared identifier 'RowD'
/data0/auto-test/kratos-code/applications/structural_application/custom_strategies/builder_and_solvers/multiphase_builder_and_solver.h:1952:17: error: use of undeclared identifier 'RowD'
/data0/auto-test/kratos-code/applications/structural_application/custom_strategies/builder_and_solvers/multiphase_builder_and_solver.h:1952:25: error: use of undeclared identifier 'RowL'
/data0/auto-test/kratos-code/applications/structural_application/custom_strategies/builder_and_solvers/multiphase_builder_and_solver.h:1955:19: error: use of undeclared identifier 'InnerIt'
/data0/auto-test/kratos-code/applications/structural_application/custom_strategies/builder_and_solvers/multiphase_builder_and_solver.h:1955:48: error: use of undeclared identifier 'ItD'
/data0/auto-test/kratos-code/applications/structural_application/custom_strategies/builder_and_solvers/multiphase_builder_and_solver.h:1955:55: error: use of undeclared identifier 'RowD'
/data0/auto-test/kratos-code/applications/structural_application/custom_strategies/builder_and_solvers/multiphase_builder_and_solver.h:1955:68: error: use of undeclared identifier 'ItD'
/data0/auto-test/kratos-code/applications/structural_application/custom_strategies/builder_and_solvers/multiphase_builder_and_solver.h:1957:35: error: use of undeclared identifier 'ItD'
/data0/auto-test/kratos-code/applications/structural_application/custom_strategies/builder_and_solvers/multiphase_builder_and_solver.h:1961:53: error: use of undeclared identifier 'ItD'; did you mean 'ItG'?
/data0/auto-test/kratos-code/applications/structural_application/custom_strategies/builder_and_solvers/multiphase_builder_and_solver.h:1964:45: error: use of undeclared identifier 'ItD'; did you mean 'ItG'?
/data0/auto-test/kratos-code/applications/structural_application/custom_strategies/builder_and_solvers/multiphase_builder_and_solver.h:1971:19: error: use of undeclared identifier 'InnerIt'
/data0/auto-test/kratos-code/applications/structural_application/custom_strategies/builder_and_solvers/multiphase_builder_and_solver.h:1971:47: error: use of undeclared identifier 'ItL'
/data0/auto-test/kratos-code/applications/structural_application/custom_strategies/builder_and_solvers/multiphase_builder_and_solver.h:1971:54: error: use of undeclared identifier 'RowL'
/data0/auto-test/kratos-code/applications/structural_application/custom_strategies/builder_and_solvers/multiphase_builder_and_solver.h:1971:66: error: use of undeclared identifier 'ItL'
/data0/auto-test/kratos-code/applications/structural_application/custom_strategies/builder_and_solvers/multiphase_builder_and_solver.h:1973:27: error: use of undeclared identifier 'ItL'
fatal error: too many errors emitted, stopping now [-ferror-limit=]
2 warnings and 20 errors generated.
make[2]: Target `applications/structural_application/CMakeFiles/KratosStructuralApplication.dir/build' not remade because of errors.
make[1]: Target `all' not remade because of errors.
make: Target `install' not remade because of errors.
Compiling Warnings  : 19
/data0/auto-test/kratos-code/applications/ExternalSolversApplication/custom_external_libraries/ITSOL_2/SRC/sets.c:19:19: warning: format string is not a string literal (potentially insecure) [-Wformat-security]
1 warning generated.
/data0/auto-test/kratos-code/applications/MeshingApplication/custom_external_libraries/msuite/src/malla/meshelm.cpp:1822:29: warning: add explicit braces to avoid dangling else [-Wdangling-else]
1 warning generated.
/usr/include/python2.6/pyconfig-64.h:1034:9: warning: '_POSIX_C_SOURCE' macro redefined
/usr/include/python2.6/pyconfig-64.h:1043:9: warning: '_XOPEN_SOURCE' macro redefined
2 warnings generated.
/data0/auto-test/kratos-code/applications/ExternalSolversApplication/custom_external_libraries/SuperLU_4.3/SRC/slu_Cnames.h:23:9: warning: 'ADD_' macro redefined
1 warning generated.
/data0/auto-test/kratos-code/applications/structural_application/custom_strategies/builder_and_solvers/multiphase_builder_and_solver.h:832:27: warning: equality comparison with extraneous parentheses [-Wparentheses-equality]
/data0/auto-test/kratos-code/applications/structural_application/custom_strategies/builder_and_solvers/multiphase_builder_and_solver.h:832:27: note: remove extraneous parentheses around the comparison to silence this warning
/data0/auto-test/kratos-code/applications/structural_application/custom_strategies/builder_and_solvers/multiphase_builder_and_solver.h:855:27: warning: equality comparison with extraneous parentheses [-Wparentheses-equality]
/data0/auto-test/kratos-code/applications/structural_application/custom_strategies/builder_and_solvers/multiphase_builder_and_solver.h:855:27: note: remove extraneous parentheses around the comparison to silence this warning
2 warnings and 20 errors generated.
/data0/auto-test/kratos-code/applications/structural_application/constitutive_laws/isotropic_3d.cpp:135:16: warning: reference to stack memory associated with local variable 'rValue' returned [-Wreturn-stack-address]
1 warning generated.
/data0/auto-test/kratos-code/applications/OpenCLapplication/custom_external_libraries/pugixml/src/pugixml.cpp:5678:42: warning: adding 'bool' to a string does not append to the string [-Wstring-plus-int]
/data0/auto-test/kratos-code/applications/OpenCLapplication/custom_external_libraries/pugixml/src/pugixml.cpp:5678:42: note: use array indexing to silence this warning
1 warning generated.
Linking Error       : 0
Running Patch_Test_Total_Lagrangian_3D_8N...
Patch_Test_Total_Lagrangian_3D_8N_benchmarking example succesful
Running Patch_Test_Total_Lagrangian_4N...
Patch_Test_Total_Lagrangian_4N_benchmarking example succesful
Running cantilever2ddynamic
cantilever2dynamic succesful
Running cantilever2dstatic using MKLPardisoSolver
Expected fail because the  program should be compiled with INTEL compliler.
Running cantilever2dstatic witdh SuperLUSolver
cantilever2dstatic witdh SuperLUSolver example succesful
Running cantilever2dstatic with classical solver
cantilever2dstatic with classical solver example succesful
Running cantilever2dstatic_parallel using ParallelSkylineLUFactorizationSolver
Expected fail because the  program should be compiled with INTEL compliler.
Running cantilever2dstatic using ParallelMKLPardisoSolver
Expected fail because the  program should be compiled with INTEL compliler.
Running cantilever3dstatic
cantilever3dstatic example succesful
Running cantilever3dynamic
cantilever3ddynamic example succesful
Running balken contact benchmark...
balken contact benchmark example FAILED
Running arc length desplacement  benchmark...
arc_length_des benchmark example successful
Running arc length  benchmark...
arc_length benchmark example successful
Pendulo Kratos Length benchmark...
Pendulo Kratos benchmark example successful
PlasticitJ2 with EBST TENSION benchmarks...
PlasticitJ2 with EBST TENSION benchmarks successful
PlasticitJ2 with EBST TORSION benchmarks...
PlasticitJ2 with EBST TORSION benchmarks successful
PlasticitJ2 with EBST VERTICAL benchmarks...
PlasticitJ2 with EBST VERTICAL benchmarks successful
PlasticitJ2 with EBST FORCE benchmarks...
PlasticitJ2 with EBST FORCE benchmarks successful
Resume of all of the examples for the structural application :
========== Structural Aplication ==========
Patch_Test_Total_Lagrangian_3D_8N: OK
Patch_Test_Total_Lagrangian_4N: OK
cantilever2dDynamic:OK
cantilever2dstatic using MKLPardisoSolver: FAILED
Different amount of benchmark data!

cantilever2dstatic_superlu: OK
cantilever2dstatic: OK
cantilever2dstatic_parallel:FAILED
Different amount of benchmark data!

cantilever2dstatic using ParallelMKLPardisoSolver: FAILED
Different amount of benchmark data!

cantilever3dstatic: OK
cantilever3ddynamic: OK
balken contact benchmark: FAILED
Different amount of benchmark data!

arc length desplacement benchmark: OK
arc length benchmark: OK
Pendulo Kratos Length benchmark: OK
PlasticitJ2 with EBST collection benchmarks: OK
OK
OK
OK

running the benchmark for naca3d test...
naca3d test example succesful
running the benchmark for mass_conservation test...
mass_conservation test example succesful
verifying  test_fractstep_cont_laplacian.py...
test_fractstep_cont_laplacian example succesful
verifying  test_fractstep_discrete_laplacian.py...
test_fractstep_discrete_laplacian example succesful
verifying  test_fractstep_cont_laplacian.py...3D
test_fractstep_cont_laplacian 3D example succesful
Running cylinder.py...
cylinder example succesful
Running Cilinder GLS example with explicit Runge-Kutta and FRAC STEP...
cilinderGLS example succesful
Running dam2d.py...
dam2d example succesful
Running StillWater_Edgebased...
StillWater_Edgebased example succesful
Running StillWater_Edgebased_halfPorous...
StillWater_Edgebased_halfPorous example succesful
Running StillWater_Elembased_halfPorous...
StillWater_Elembased_halfPorous example succesful
Running script.py...
cavity_monolithic_3d example succesful
resume of all of the examples for the fluid application :
== Incompressible_Fluid ==========
naca3d test: OK
mass conservation test: OK
cavity2D: OK
OK
cavity3D: OK
cylinder: OK
cilinderGLS: OK
dam2d: OK
StillWater_Edgebased: OK
StillWater_Edgebased_halfPorous: OK
StillWater_Elembased_halfPorous: OK
cavity_monolithic_3d: OK

Running Adaptive Mesher 2d benchmark...
Adaptive_mesher2d benchmarking example succesful
Running Adaptive Mesher 3d benchmark...
Adaptive_mesher2d benchmarking example succesful
Running Mapping_2d benchmark...
Mapping_2d benchmarking example succesful
Running Mapping_3d benchmark...
Mapping_3d benchmarking example succesful
Running Mapping_2d_BinBased benchmark...
Mapping_2d_BinBased benchmarking example succesful
Running Mapping_3d_BinBased benchmark...
Mapping_3d_BinBased benchmarking example succesful
verifying  connectivity_preserve_modeler benchmark...
connectivity_preserve_modeler benchmark succesful
resume of all of the examples for the meshing application :
========== Meshing Aplication ==========
adaptive_mesher2d: OK
adaptive_mesher3d: OK
Mapping_2d: OK
Mapping_3d: OK
Mapping_2d_BinBased: OK
Mapping_3d_BinBased: OK
connectivity_preserve_modeler benchmark: OK

Running edgebased_PureConvection.py...
testConvectionEdgebased example succesful
Running testPureConvection.py...
testPureConvection example FAILED
resume of all of the examples for the fluid application :
== Convection_Diffusion ==========
square_edgebased: OK
pure_convection: FAILED
Different amount of benchmark data!


Running mesh.py...
non-conformant mesh example successful
resume of all of the examples for the FSI application :
== FSI_application ==========
meshtest: OK

Running mesh.py...
non-conformant mesh example successful
resume of all of the examples for the FSI application :
== FSI_application ==========
meshtest: OK

running the vms2d_test benchmark test...
VMS2D element test succesful
Running VMS test: parabolic flow in a trapezoidal domain solved using OSS
oss_trapezoid test succesful
Running slip condition test...
slip condition test succesful
resume of all of the examples for the Fluid Dynamics application :
== Fluid Dynamics ==========
VMS2D element test: OK
Parabolic flow OSS test: OK
Slip condition and wall law test: OK

running the benchmark for the Activation_test ...
Activation_test  example succesful
resume of all of the examples for the ThermoMechanical Application  :
== ThermoMechanical Application ==========
Activation_test : OK

running the benchmark for the Activation_test ...
Activation_test  example succesful
resume of all of the examples for the ThermoMechanical Application  :
== ThermoMechanical Application ==========
Activation_test : OK

Running Trilinos -- Cantilever_Amesos...
cantilever_amesos.py example FAILED
Running Trilinos -- Cantilever_Aztec...
Trilinos Cantilever_Aztec example succesful
Running Trilinos -- Cantilever_ML...
Trilinos Cantilever_ML example succesful
resume of all of the examples for the fluid application :
========== Trilinos Aplication ==========
Trilinos -- Cantilever_Amesos: FAILED
Different amount of benchmark data!

Trilinos -- Cantilever_Aztec: OK
Trilinos -- Cantilever_ML (including rotations in null space): OK

running the two_balls_no_damp benchmark test...
two_balls_no_damp element test FAILED
resume of all of the examples for the DEM application :
========== DEM ==========
DEM element test: FAILED
Different amount of benchmark data!


Status of Kratos examples:

========== Structural Aplication ==========
Patch_Test_Total_Lagrangian_3D_8N: OK
Patch_Test_Total_Lagrangian_4N: OK
cantilever2dDynamic:OK
cantilever2dstatic using MKLPardisoSolver: FAILED
Different amount of benchmark data!

cantilever2dstatic_superlu: OK
cantilever2dstatic: OK
cantilever2dstatic_parallel:FAILED
Different amount of benchmark data!

cantilever2dstatic using ParallelMKLPardisoSolver: FAILED
Different amount of benchmark data!

cantilever3dstatic: OK
cantilever3ddynamic: OK
balken contact benchmark: FAILED
Different amount of benchmark data!

arc length desplacement benchmark: OK
arc length benchmark: OK
Pendulo Kratos Length benchmark: OK
PlasticitJ2 with EBST collection benchmarks: OK
OK
OK
OK
== Incompressible_Fluid ==========
naca3d test: OK
mass conservation test: OK
cavity2D: OK
OK
cavity3D: OK
cylinder: OK
cilinderGLS: OK
dam2d: OK
StillWater_Edgebased: OK
StillWater_Edgebased_halfPorous: OK
StillWater_Elembased_halfPorous: OK
cavity_monolithic_3d: OK
========== Meshing Aplication ==========
adaptive_mesher2d: OK
adaptive_mesher3d: OK
Mapping_2d: OK
Mapping_3d: OK
Mapping_2d_BinBased: OK
Mapping_3d_BinBased: OK
connectivity_preserve_modeler benchmark: OK
== Convection_Diffusion ==========
square_edgebased: OK
pure_convection: FAILED
Different amount of benchmark data!

== FSI_application ==========
meshtest: OK
== Fluid Dynamics ==========
VMS2D element test: OK
Parabolic flow OSS test: OK
Slip condition and wall law test: OK
== ThermoMechanical Application ==========
Activation_test : OK
========== Trilinos Aplication ==========
Trilinos -- Cantilever_Amesos: FAILED
Different amount of benchmark data!

Trilinos -- Cantilever_Aztec: OK
Trilinos -- Cantilever_ML (including rotations in null space): OK
========== DEM ==========
DEM element test: FAILED
Different amount of benchmark data!



Benchmarking:

Benchmarking:
### Process ended. ###
------------ próxima parte ------------
Se ha borrado un mensaje que no está en formato texto plano...
Nombre     : clang_logfile.zip
Tipo       : application/zip
Tamaño     : 7027 bytes
Descripción: no disponible
Url        : http://listas.cimne.upc.edu/pipermail/kratos/attachments/20120803/b7d108f4/attachment.zip 


Más información sobre la lista de distribución Kratos